Reaction Details
TargetIntegrin-linked protein kinase
LigandBDBM123933
Substrate/Competitorn/a
Meas. Tech.In Vitro Ezyme Assay
Temperature313.15±n/a K
IC50 40±n/a nM
Commentsextracted
Citation Zhang, ZDaynard, TSWang, SDu, XChopiuk, GBYan, JChen, JSviridov, SV Pyrazolylbenzothiazole derivatives and their use as therapeutic agents US Patent US8754233 Publication Date 6/17/2014
 
Integrin-linked protein kinase
Name:Integrin-linked protein kinase
Type:Protein
Mol. Mass.:51429.75
Organism:Homo sapiens (Human)
Description:Q13418
Residue:452
BDBM123933
NameBDBM123933
Synonyms:US8754233, 2-(3-Amino-5-methyl-1H-pyrazol-4-yl)-5-fluoro-benzothiazole-6-sulfonic acid methylamide
TypeSmall organic molecule
Emp. Form.C12H12FN5O2S2
Mol. Mass.341.384
SMILESCNS(=O)(=O)c1cc2sc(nc2cc1F)-c1c(C)[nH]nc1N