Reaction Details
TargetIntegrin-linked protein kinase
LigandBDBM123950
Substrate/Competitorn/a
Meas. Tech.In Vitro Ezyme Assay
Temperature313.15±n/a K
IC50 300±n/a nM
Commentsextracted
Citation Zhang, ZDaynard, TSWang, SDu, XChopiuk, GBYan, JChen, JSviridov, SV Pyrazolylbenzothiazole derivatives and their use as therapeutic agents US Patent US8754233 Publication Date 6/17/2014
 
Integrin-linked protein kinase
Name:Integrin-linked protein kinase
Type:Protein
Mol. Mass.:51429.75
Organism:Homo sapiens (Human)
Description:Q13418
Residue:452
BDBM123950
NameBDBM123950
Synonyms:US8754233, 2-(5-Amino-3-methyl-1H-pyrazol-4-yl)-benzothiazole-6-carboxylic acid amide
TypeSmall organic molecule
Emp. Form.C12H11N5OS
Mol. Mass.273.314
SMILESCc1[nH]nc(N)c1-c1nc2ccc(cc2s1)C(N)=O