Reaction Details
TargetIntegrin-linked protein kinase
LigandBDBM124041
Substrate/Competitorn/a
Meas. Tech.In Vitro Ezyme Assay
Temperature313.15±n/a K
IC50 150±n/a nM
Commentsextracted
Citation Zhang, ZDaynard, TSWang, SDu, XChopiuk, GBYan, JChen, JSviridov, SV Pyrazolylbenzothiazole derivatives and their use as therapeutic agents US Patent US8754233 Publication Date 6/17/2014
 
Integrin-linked protein kinase
Name:Integrin-linked protein kinase
Type:Protein
Mol. Mass.:51429.75
Organism:Homo sapiens (Human)
Description:Q13418
Residue:452
BDBM124041
NameBDBM124041
Synonyms:US8754233, 4-Benzothiazol-2-yl-N3-(2-ethylamino-ethyl)-1H-pyrazole-3,5-diamine
TypeSmall organic molecule
Emp. Form.C14H18N6S
Mol. Mass.302.398
SMILESCCNCCNc1[nH]nc(N)c1-c1nc2ccccc2s1