Reaction Details
TargetTyrosine-protein phosphatase non-receptor type 1
LigandBDBM124220
Substrate/Competitorn/a
Meas. Tech.Enzyme Assays
IC50 5±0.0 nM
Citation Patel, DJain, MShah, SRBahekar, RJadav, PDarji, BSiriki, YBandyopadhyay, DJoharapurkar, AKshirsagar, SPatel, HShaikh, MSairam, KVPatel, P Discovery of orally active, potent, and selective benzotriazole-based PTP1B inhibitors. ChemMedChem6:1011-6 (2011) 
 
Tyrosine-protein phosphatase non-receptor type 1
Name:Tyrosine-protein phosphatase non-receptor type 1
Type:Protein phosphatase
Mol. Mass.:49963.76
Organism:Homo sapiens (Human)
Description:Human recombinant GST-fusion PTP1B (1-435).
Residue:435
BDBM124220
NameBDBM124220
Synonyms:({2-[2-(1H-1,2,3-benzotriazol-1-yl)-2-({6-bromo-7-[difluoro(phosphono)methyl]quinolin-2-yl}methyl)-3-oxo-3-phenylpropyl]-6-bromoquinolin-7-yl}difluoromethyl)phosphonic acid (10n)
TypeSmall organic molecule
Emp. Form.C36H25Br2F4N5O7P2
Mol. Mass.937.362
SMILESOP(O)(=O)C(F)(F)c1cc2nc(CC(Cc3ccc4cc(Br)c(cc4n3)C(F)(F)P(O)(O)=O)(C(=O)c3ccccc3)n3nnc4ccccc34)ccc2cc1Br