Reaction Details
TargetNeuraminidase
LigandBDBM4734
Substrate/CompetitorBDBM4702
Meas. Tech.Neuraminidase Inhibition Assay
pH6.5±n/a
Temperature310.15±n/a K
IC50 6000±n/a nM
Citation Chand, PKotian, PLMorris, PEBantia, SWalsh, DABabu, YS Synthesis and inhibitory activity of benzoic acid and pyridine derivatives on influenza neuraminidase. Bioorg Med Chem13:2665-78 (2005) 
 
Neuraminidase
Name:Neuraminidase
Type:Enzyme
Mol. Mass.:52468.81
Organism:Influenza A virus (N9)
Description:P03472
Residue:470
BDBM4734
BDBM4702
NameBDBM4734
Synonyms:5-Acetylamino-6-[(aminoiminomethyl)amino]pyridine-2-carboxylic acid pyridine deriv. 35
TypeSmall organic molecule
Emp. Form.C9H11N5O3
Mol. Mass.237.2153
SMILESCC(=O)Nc1ccc(nc1N=C(N)N)C(O)=O