Reaction Details
TargetFatty acid synthase
LigandBDBM128362
Substrate/Competitorn/a
Meas. Tech.Biological Assay
pH7±n/a
IC50 5±n/a nM
Commentsextracted
Citation Adams, NDAquino, CJChaudhari, AMGhergurovich, JMKiesow, TJParrish, CAReif, AJWiggall, K Triazolones as fatty acid synthase inhibitors US Patent US8802864 Publication Date 8/12/2014
 
Fatty acid synthase
Name:Fatty acid synthase
Type:Enzyme
Mol. Mass.:273419.37
Organism:Homo sapiens (Human)
Description:P49327
Residue:2511
BDBM128362
NameBDBM128362
Synonyms:US8802864, 42
TypeSmall organic molecule
Emp. Form.C26H27N5O2
Mol. Mass.441.5249
SMILESCc1cc(ccc1-n1c(C[C@@H]2CCN(C2)C(=O)C2CC2)n[nH]c1=O)-c1ccc2cc[nH]c2c1