Reaction Details
TargetTrace amine-associated receptor 7b
LigandBDBM129420
Substrate/Competitorn/a
Meas. Tech.Radioligand Binding
pH7.4±n/a
Temperature310.15±n/a K
Ki 9.4±n/a nM
Commentsextracted
Citation Galley, GNorcross, RDPflieger, P Heterocyclic amine derivatives US Patent US8802673 Publication Date 8/12/2014
 
Trace amine-associated receptor 7b
Name:Trace amine-associated receptor 7b
Type:Enzyme
Mol. Mass.:40296.65
Organism:Rattus norvegicus (Rat)
Description:Q923X8
Residue:358
BDBM129420
NameBDBM129420
Synonyms:US8802673, 62
TypeSmall organic molecule
Emp. Form.C16H18BrN3O
Mol. Mass.348.238
SMILESCc1cc(Nc2ccc(cc2)[C@H]2CNCCO2)ncc1Br