Reaction Details
TargetSteroid 17-alpha-hydroxylase/17,20 lyase
LigandBDBM132216
Substrate/Competitorn/a
Meas. Tech.Enzyme Assay
IC50 2.7±n/a nM
Citation Bock, MGGaul, CGunmadi, VRSengupta, S Inhibitors of CYP 17 US Patent US Patent
 
Steroid 17-alpha-hydroxylase/17,20 lyase
Name:Steroid 17-alpha-hydroxylase/17,20 lyase
Type:Enzyme
Mol. Mass.:57382.42
Organism:Homo sapiens (Human)
Description:E.coli expressing human CYP17
Residue:508
BDBM132216
NameBDBM132216
Synonyms:USRE45173, 155A | USRE45173, 192A
TypeSmall organic molecule
Emp. Form.C14H12F3N3OS
Mol. Mass.327.325
SMILESCc1ccncc1N1CCN(C1=O)c1ccc(s1)C(F)(F)F