Reaction Details
TargetDihydrofolate reductase
LigandBDBM25826
Substrate/Competitorn/a
Meas. Tech.Spectrophotometric Enzyme Assay
IC50 1360±n/a nM
Citation Anderson, ACWright, DLFrey, KMPaulsen, JLScocchera, EWViswanathan, K Heterocyclic analogs of propargyl-linked inhibitors of dihydrofolate reductase US Patent US8853228 Publication Date 10/7/2014
 
Dihydrofolate reductase
Name:Dihydrofolate reductase
Type:Enzyme
Mol. Mass.:21453.99
Organism:Homo sapiens (Human)
Description:Recombinant human DHFR.
Residue:187
BDBM25826
NameBDBM25826
Synonyms:5-[(3R)-3-(3-methoxy-5-phenylphenyl)but-1-yn-1-yl]-6-methylpyrimidine-2,4-diamine | propargyl-based inhibitor, R-10a
TypeSmall organic molecule
Emp. Form.C22H22N4O
Mol. Mass.358.4363
SMILESCOc1cc(cc(c1)-c1ccccc1)[C@@H](C)C#Cc1c(C)nc(N)nc1N