Reaction Details
TargetC5a anaphylatoxin chemotactic receptor 1
LigandBDBM134571
Substrate/Competitorn/a
Meas. Tech.FLIPR Assay
IC50 2±n/a nM
Citation Adams, CMDarsigny, VFlyer, ANGelin, CFHurley, TBJi, NKarki, RGKawanami, TMeredith, ERao, CSerrano-Wu, MHSolovay, CF Tetrahydropyrido-pyridine and tetrahydropyrido-pyrimidine compounds and use thereof as C5a receptor modulators US Patent US8846656 Publication Date 9/30/2014
 
C5a anaphylatoxin chemotactic receptor 1
Name:C5a anaphylatoxin chemotactic receptor 1
Type:Enzyme
Mol. Mass.:39347.68
Organism:Homo sapiens (Human)
Description:P21730
Residue:350
BDBM134571
NameBDBM134571
Synonyms:US8846656, 54-B
TypeSmall organic molecule
Emp. Form.C30H39ClN8O
Mol. Mass.563.137
SMILESCO[C@@H]1CCN([C@H](C)C1)c1nc(nc2CCN(Cc12)c1c(Cl)c(nn1C)C(C)C)-c1c(C)ccc2[nH]nc(C)c12