Reaction Details
TargetC5a anaphylatoxin chemotactic receptor 1
LigandBDBM134574
Substrate/Competitorn/a
Meas. Tech.FLIPR Assay
IC50 1±n/a nM
Citation Adams, CMDarsigny, VFlyer, ANGelin, CFHurley, TBJi, NKarki, RGKawanami, TMeredith, ERao, CSerrano-Wu, MHSolovay, CF Tetrahydropyrido-pyridine and tetrahydropyrido-pyrimidine compounds and use thereof as C5a receptor modulators US Patent US8846656 Publication Date 9/30/2014
 
C5a anaphylatoxin chemotactic receptor 1
Name:C5a anaphylatoxin chemotactic receptor 1
Type:Enzyme
Mol. Mass.:39347.68
Organism:Homo sapiens (Human)
Description:P21730
Residue:350
BDBM134574
NameBDBM134574
Synonyms:US8846656, 55-I
TypeSmall organic molecule
Emp. Form.C29H35ClF2N8O
Mol. Mass.585.091
SMILESCO[C@@H]1CCN(CC1(C)C)c1nc(nc2CCN(Cc12)c1c(Cl)c(nn1C)C(F)F)-c1c(C)ccc2[nH]nc(C)c12