Reaction Details
TargetC5a anaphylatoxin chemotactic receptor 1
LigandBDBM134524
Substrate/Competitorn/a
Meas. Tech.FLIPR Assay
IC50 1±n/a nM
Citation Adams, CMDarsigny, VFlyer, ANGelin, CFHurley, TBJi, NKarki, RGKawanami, TMeredith, ERao, CSerrano-Wu, MHSolovay, CF Tetrahydropyrido-pyridine and tetrahydropyrido-pyrimidine compounds and use thereof as C5a receptor modulators US Patent US8846656 Publication Date 9/30/2014
 
C5a anaphylatoxin chemotactic receptor 1
Name:C5a anaphylatoxin chemotactic receptor 1
Type:Enzyme
Mol. Mass.:39347.68
Organism:Homo sapiens (Human)
Description:P21730
Residue:350
BDBM134524
NameBDBM134524
Synonyms:US8846656, 21-AM
TypeSmall organic molecule
Emp. Form.C32H40N6
Mol. Mass.508.7002
SMILESCC(C)c1ccc(C)c(c1)N1CCc2nc(nc(N3CCCC[C@H]3C)c2C1)-c1c(C)ccc2[nH]nc(C)c12