Reaction Details
TargetC5a anaphylatoxin chemotactic receptor 1
LigandBDBM134601
Substrate/Competitorn/a
Meas. Tech.FLIPR Assay
IC50 2±n/a nM
Citation Adams, CMDarsigny, VFlyer, ANGelin, CFHurley, TBJi, NKarki, RGKawanami, TMeredith, ERao, CSerrano-Wu, MHSolovay, CF Tetrahydropyrido-pyridine and tetrahydropyrido-pyrimidine compounds and use thereof as C5a receptor modulators US Patent US8846656 Publication Date 9/30/2014
 
C5a anaphylatoxin chemotactic receptor 1
Name:C5a anaphylatoxin chemotactic receptor 1
Type:Enzyme
Mol. Mass.:39347.68
Organism:Homo sapiens (Human)
Description:P21730
Residue:350
BDBM134601
NameBDBM134601
Synonyms:US8846656, 71-B
TypeSmall organic molecule
Emp. Form.C32H41FN8O
Mol. Mass.572.7193
SMILESCCn1nc(C2CC2)c(F)c1N1CCc2nc(nc(N3CC[C@@H](OC)C(C)(C)C3)c2C1)-c1c(C)ccc2[nH]nc(C)c12