Reaction Details
TargetHigh affinity nerve growth factor receptor
LigandBDBM30547
Substrate/Competitorn/a
Meas. Tech.Enzyme Assay
IC50 0.681±n/a nM
Citation Andrews, MDBagal, SKGibson, KROmoto, KRyckmans, TSkerratt, SEStupple, PA Pyrrolo[2,3-d]pyrimidine tropomysin-related kinase inhibitors US Patent US8846698 Publication Date 9/30/2014
 
High affinity nerve growth factor receptor
Name:High affinity nerve growth factor receptor
Type:n/a
Mol. Mass.:87498.18
Organism:Homo sapiens (Human)
Description:P04629
Residue:796
BDBM30547
NameBDBM30547
Synonyms:US8846698, 583
Typen/a
Emp. Form.C24H20ClN7O2
Mol. Mass.473.914
SMILESNc1ncc2c(cn(c2n1)C12CC(C1)C2)C(=O)c1cncc(NC(=O)Cc2ccc(Cl)cn2)c1