Reaction Details
TargetHigh affinity nerve growth factor receptor
LigandBDBM134750
Substrate/Competitorn/a
Meas. Tech.Enzyme Assay
IC50 4.4±n/a nM
Citation Andrews, MDBagal, SKGibson, KROmoto, KRyckmans, TSkerratt, SEStupple, PA Pyrrolo[2,3-d]pyrimidine tropomysin-related kinase inhibitors US Patent US8846698 Publication Date 9/30/2014
 
High affinity nerve growth factor receptor
Name:High affinity nerve growth factor receptor
Type:n/a
Mol. Mass.:87498.18
Organism:Homo sapiens (Human)
Description:P04629
Residue:796
BDBM134750
NameBDBM134750
Synonyms:US8846698, 213 | US8846698, 215
TypeSmall organic molecule
Emp. Form.C24H21F3N6O3
Mol. Mass.498.4571
SMILESCC(CO)n1cc(C(=O)c2cncc(NC(=O)Cc3cccc(c3)C(F)(F)F)c2)c2cnc(N)nc12