Reaction Details
TargetHigh affinity nerve growth factor receptor
LigandBDBM134787
Substrate/Competitorn/a
Meas. Tech.Enzyme Assay
IC50 3.48±n/a nM
Citation Andrews, MDBagal, SKGibson, KROmoto, KRyckmans, TSkerratt, SEStupple, PA Pyrrolo[2,3-d]pyrimidine tropomysin-related kinase inhibitors US Patent US8846698 Publication Date 9/30/2014
 
High affinity nerve growth factor receptor
Name:High affinity nerve growth factor receptor
Type:n/a
Mol. Mass.:87498.18
Organism:Homo sapiens (Human)
Description:P04629
Residue:796
BDBM134787
NameBDBM134787
Synonyms:US8846698, 250
TypeSmall organic molecule
Emp. Form.C23H21ClN6O2
Mol. Mass.448.905
SMILESCC(C)n1cc(C(=O)c2cncc(NC(=O)Cc3ccc(Cl)cc3)c2)c2cnc(N)nc12