Reaction Details
TargetHigh affinity nerve growth factor receptor
LigandBDBM135041
Substrate/Competitorn/a
Meas. Tech.Enzyme Assay
IC50 4.53±n/a nM
Citation Andrews, MDBagal, SKGibson, KROmoto, KRyckmans, TSkerratt, SEStupple, PA Pyrrolo[2,3-d]pyrimidine tropomysin-related kinase inhibitors US Patent US8846698 Publication Date 9/30/2014
 
High affinity nerve growth factor receptor
Name:High affinity nerve growth factor receptor
Type:n/a
Mol. Mass.:87498.18
Organism:Homo sapiens (Human)
Description:P04629
Residue:796
BDBM135041
NameBDBM135041
Synonyms:US8846698, 524
TypeSmall organic molecule
Emp. Form.C25H20F3N5O3
Mol. Mass.495.4532
SMILESOCC1(CC1)n1cc(C(=O)c2cncc(NC(=O)Cc3ccc(cc3)C(F)(F)F)c2)c2cncnc12