Reaction Details
TargetHigh affinity nerve growth factor receptor
LigandBDBM135062
Substrate/Competitorn/a
Meas. Tech.Enzyme Assay
IC50 3.22±n/a nM
Citation Andrews, MDBagal, SKGibson, KROmoto, KRyckmans, TSkerratt, SEStupple, PA Pyrrolo[2,3-d]pyrimidine tropomysin-related kinase inhibitors US Patent US8846698 Publication Date 9/30/2014
 
High affinity nerve growth factor receptor
Name:High affinity nerve growth factor receptor
Type:n/a
Mol. Mass.:87498.18
Organism:Homo sapiens (Human)
Description:P04629
Residue:796
BDBM135062
NameBDBM135062
Synonyms:US8846698, 549
TypeSmall organic molecule
Emp. Form.C23H23F3N8O3
Mol. Mass.516.4757
SMILESCOCC(C)(C)n1cc(C(=O)c2cncc(NC(=O)Cn3ccc(n3)C(F)(F)F)c2)c2cnc(N)nc12