Reaction Details
TargetHigh affinity nerve growth factor receptor
LigandBDBM135101
Substrate/Competitorn/a
Meas. Tech.Enzyme Assay
IC50 6.07±n/a nM
Citation Andrews, MDBagal, SKGibson, KROmoto, KRyckmans, TSkerratt, SEStupple, PA Pyrrolo[2,3-d]pyrimidine tropomysin-related kinase inhibitors US Patent US8846698 Publication Date 9/30/2014
 
High affinity nerve growth factor receptor
Name:High affinity nerve growth factor receptor
Type:n/a
Mol. Mass.:87498.18
Organism:Homo sapiens (Human)
Description:P04629
Residue:796
BDBM135101
NameBDBM135101
Synonyms:US8846698, 578
TypeSmall organic molecule
Emp. Form.C24H20FN7O2
Mol. Mass.457.4597
SMILESNc1ncc2c(cn(c2n1)C12CC(C1)C2)C(=O)c1cncc(NC(=O)Cc2ccc(F)cn2)c1