Reaction Details
TargetGenome polyprotein
LigandBDBM139221
Substrate/Competitorn/a
Meas. Tech.Polymerase Assay
pH7.5±n/a
Temperature308.15±n/a K
IC50 1.8e+4±n/a nM
Commentsextracted
Citation Cho, AKim, CUKirschberg, TAMish, MRSquires, N 1′-substituted pyrimidine N-nucleoside analogs for antiviral treatment US Patent US8877733 Publication Date 11/4/2014
 
Genome polyprotein
Name:Genome polyprotein
Type:Protein
Mol. Mass.:327266.82
Organism:Hepatitis C virus (HCV)
Description:P26664
Residue:3011
BDBM139221
NameBDBM139221
Synonyms:US8877733, 28
TypeSmall organic molecule
Emp. Form.C11H17N4O14P3
Mol. Mass.522.1924
SMILESC[C@]1(O)[C@@H](O)[C@H](COP(O)(=O)OP(O)(=O)OP(O)(O)=O)O[C@]1(C#N)n1ccc(N)nc1=O