Reaction Details
TargetIntegrin alpha-5
LigandBDBM141978
Substrate/Competitorn/a
Meas. Tech.Binding Assay
pH9.6±n/a
Temperature277.15±n/a K
IC50<100±n/a nM
Commentsextracted
Citation Zischinsky, GStragies, ROsterkamp, FScharn, DHummel, GKalkhof, HZahn, GVossmeyer, DChristner-Albrecht, CReineke, U Compounds for the inhibition of integrins and use thereof US Patent US8927534 Publication Date 1/6/2015
 
Integrin alpha-5
Name:Integrin alpha-5
Type:Single-pass type I membrane protein
Mol. Mass.:114523.00
Organism:Homo sapiens (Human)
Description:n/a
Residue:1049
BDBM141978
NameBDBM141978
Synonyms:US8927534, 29
TypeSmall organic molecule
Emp. Form.C27H40N4O4
Mol. Mass.484.6309
SMILESCC1(CCCCC1)C(=O)NC(CC1CCN(CC1)C(=O)CCc1ccc2CCCNc2n1)C(O)=O