Reaction Details
TargetIntegrin alpha-IIb
LigandBDBM141978
Substrate/Competitorn/a
Meas. Tech.Binding Assay
pH9.6±n/a
Temperature277.15±n/a K
IC50>1000±n/a nM
Commentsextracted
Citation Zischinsky, GStragies, ROsterkamp, FScharn, DHummel, GKalkhof, HZahn, GVossmeyer, DChristner-Albrecht, CReineke, U Compounds for the inhibition of integrins and use thereof US Patent US8927534 Publication Date 1/6/2015
 
Integrin alpha-IIb
Name:Integrin alpha-IIb
Type:Protein
Mol. Mass.:113354.85
Organism:Homo sapiens (Human)
Description:P08514
Residue:1039
BDBM141978
NameBDBM141978
Synonyms:US8927534, 29
TypeSmall organic molecule
Emp. Form.C27H40N4O4
Mol. Mass.484.6309
SMILESCC1(CCCCC1)C(=O)NC(CC1CCN(CC1)C(=O)CCc1ccc2CCCNc2n1)C(O)=O