Reaction Details
TargetIntegrin alpha-IIb
LigandBDBM141973
Substrate/Competitorn/a
Meas. Tech.Binding Assay
pH9.6±n/a
Temperature277.15±n/a K
IC50>1000±n/a nM
Commentsextracted
Citation Zischinsky, GStragies, ROsterkamp, FScharn, DHummel, GKalkhof, HZahn, GVossmeyer, DChristner-Albrecht, CReineke, U Compounds for the inhibition of integrins and use thereof US Patent US8927534 Publication Date 1/6/2015
 
Integrin alpha-IIb
Name:Integrin alpha-IIb
Type:Protein
Mol. Mass.:113354.85
Organism:Homo sapiens (Human)
Description:P08514
Residue:1039
BDBM141973
NameBDBM141973
Synonyms:US8927534, 114 | US8927534, 83
TypeSmall organic molecule
Emp. Form.C30H34N4O4
Mol. Mass.514.6154
SMILESCc1ccnc(NCC2CN(C(=O)C2)c2ccc(CC(NC(=O)c3c(C)cc(C)cc3C)C(O)=O)cc2)c1