Reaction Details
Target11-beta-hydroxysteroid dehydrogenase 1
LigandBDBM142001
Substrate/Competitorn/a
Meas. Tech.Enzyme Inhibition Assay
pH7.4±n/a
Temperature298.15±n/a K
IC50 0.3±n/a nM
Commentsextracted
Citation Mori, MFujii, KInui, MBaba, TOnishi, YAoyagi, A Tetrahydrothiazepine derivative US Patent US8927536 Publication Date 1/6/2015
 
11-beta-hydroxysteroid dehydrogenase 1
Name:11-beta-hydroxysteroid dehydrogenase 1
Type:Enzyme
Mol. Mass.:32409.16
Organism:Homo sapiens (Human)
Description:P28845
Residue:292
BDBM142001
NameBDBM142001
Synonyms:US8927536, 26
TypeSmall organic molecule
Emp. Form.C22H23FN4OS
Mol. Mass.410.508
SMILESCC1(CO)Cc2nnc(n2CCS1)C1(CC1)c1ccc(c(F)c1)-c1cccnc1