Reaction Details
TargetCoagulation factor XI
LigandBDBM285890
Substrate/Competitorn/a
Meas. Tech.Factor XIa Assay
pH7.4±n/a
IC50 0.380±n/a nM
Commentsextracted
Citation Mertz, EEdmondson, SDSo, SSun, WLiu, WNeelamkavil, SFGao, YHruza, AZang, YAli, AMal, RHe, JKuang, RWu, HOgawa, AKNolting, AF Factor XIa inhibitors US Patent US10081617 Publication Date 9/25/2018
 
Coagulation factor XI
Name:Coagulation factor XI
Type:Enzyme
Mol. Mass.:70130.58
Organism:Homo sapiens (Human)
Description:P03951
Residue:625
BDBM285890
NameBDBM285890
Synonyms:2-methoxyethyl [4-(2-{3- [5-chloro-2-(1H-tetrazol-1- yl)phenyl]-7-hydroxy-1- oxido-6,7-dihydro-5H- cyclopenta[b]pyridin-7-yl}- 1H-imidazol-5- yl)phenyl]carbamate US10081617, Example 39
TypeSmall organic molecule
Emp. Form.C28H25ClN8O5
Mol. Mass.589.002
SMILESCOCCOC(=O)Nc1ccc(cc1)-c1cnc([nH]1)C1(O)CCc2cc(c[n+]([O-])c12)-c1cc(Cl)ccc1-n1cnnn1