Reaction Details
TargetCoagulation factor XI
LigandBDBM285898
Substrate/Competitorn/a
Meas. Tech.Factor XIa Assay
pH7.4±n/a
IC50 0.330±n/a nM
Commentsextracted
Citation Mertz, EEdmondson, SDSo, SSun, WLiu, WNeelamkavil, SFGao, YHruza, AZang, YAli, AMal, RHe, JKuang, RWu, HOgawa, AKNolting, AF Factor XIa inhibitors US Patent US10081617 Publication Date 9/25/2018
 
Coagulation factor XI
Name:Coagulation factor XI
Type:Enzyme
Mol. Mass.:70130.58
Organism:Homo sapiens (Human)
Description:P03951
Residue:625
BDBM285898
NameBDBM285898
Synonyms:7-(5-(5-carboxythiophen-2-yl)-4-chloro-1H-imidazol-2-yl)-3-(5-chloro-2-(1H-tetrazol-1-yl)phenyl)-7-hydroxy-6,7-dihydro-5H-cyclopenta[b]pyridine US10081617, Example 47
TypeSmall organic molecule
Emp. Form.C31H32Cl2N4O6S
Mol. Mass.659.581
SMILESCC(C)(C)OC(=O)Nc1ccc(Cl)cc1C1=CC2=C([N]([O-])=C1)C(O)(CC2)c1nc(Cl)c([nH]1)-c1ccc(s1)C(=O)OC(C)(C)C