Reaction Details
TargetCoagulation factor XI
LigandBDBM285974
Substrate/Competitorn/a
Meas. Tech.Factor XIa Assay
pH7.4±n/a
IC50 0.600±n/a nM
Commentsextracted
Citation Mertz, EEdmondson, SDSo, SSun, WLiu, WNeelamkavil, SFGao, YHruza, AZang, YAli, AMal, RHe, JKuang, RWu, HOgawa, AKNolting, AF Factor XIa inhibitors US Patent US10081617 Publication Date 9/25/2018
 
Coagulation factor XI
Name:Coagulation factor XI
Type:Enzyme
Mol. Mass.:70130.58
Organism:Homo sapiens (Human)
Description:P03951
Residue:625
BDBM285974
NameBDBM285974
Synonyms:US10081617, Example 121 | methyl [4-(2-{(7S)-3-[5-chloro- 2-(4-chloro-1H-1,2,3-triazol-1- yl)phenyl]-7-hydroxy-1-oxido- 6,7-dihydro-5H- cyclopenta[b]pyridin-7-yl}-1H- imidazol-5-yl)phenyl]carbamate
TypeSmall organic molecule
Emp. Form.C27H21Cl2N7O4
Mol. Mass.578.406
SMILESCOC(=O)Nc1ccc(cc1)-c1cnc([nH]1)[C@]1(O)CCc2cc(c[n+]([O-])c12)-c1cc(Cl)ccc1-n1cc(Cl)nn1