Reaction Details
TargetDipeptidyl peptidase 4
LigandBDBM50050525
Substrate/Competitorn/a
Meas. Tech.Inhibition Assay
pH2±0
IC50 0.26±0 nM
Citation Bachovchin, WWLai, HWu, W Soft protease inhibitors and pro-soft forms thereof US Patent US8933056 Publication Date 1/13/2015
 
Dipeptidyl peptidase 4
Name:Dipeptidyl peptidase 4
Type:Enzyme
Mol. Mass.:88271.01
Organism:Homo sapiens (Human)
Description:P27487
Residue:766
BDBM50050525
NameBDBM50050525
Synonyms:(R)-1-((S)-2-aminopropanoyl)pyrrolidin-2-ylboronic acid CHEMBL63860 US11559537, Compound 1129 US8933056, Asp-boroPro
TypeSmall organic molecule
Emp. Form.C7H15BN2O3
Mol. Mass.186.017
SMILESC[C@H](N)C(=O)N1CCC[C@H]1B(O)O