Reaction Details
TargetDipeptidyl peptidase 4
LigandBDBM50050521
Substrate/Competitorn/a
Meas. Tech.Inhibition Assay
pH2±0
IC50 1.1±0 nM
Citation Bachovchin, WWLai, HWu, W Soft protease inhibitors and pro-soft forms thereof US Patent US8933056 Publication Date 1/13/2015
 
Dipeptidyl peptidase 4
Name:Dipeptidyl peptidase 4
Type:Enzyme
Mol. Mass.:88271.01
Organism:Homo sapiens (Human)
Description:P27487
Residue:766
BDBM50050521
NameBDBM50050521
Synonyms:(2-Dihydroxyborane-pyrrolidin-1-yl)-pyrrolidin-2-yl-methanone(PBP) Boronic acid derivative US11096924, DASH-inhibitors 1181 | US11559537, Compound 1181
TypeSmall organic molecule
Emp. Form.C9H17BN2O3
Mol. Mass.212.054
SMILESOB(O)[C@@H]1CCCN1C(=O)[C@@H]1CCCN1