Reaction Details
TargetTyrosine-protein kinase JAK1
LigandBDBM100349
Substrate/Competitorn/a
Meas. Tech.Ambit KinomeScan Assay
Kd 11±n/a nM
Citation Bauer, SMPandey, A Inhibitors of protein kinases US Patent US8937070 Publication Date 1/20/2015
 
Tyrosine-protein kinase JAK1
Name:Tyrosine-protein kinase JAK1
Type:Protein
Mol. Mass.:133293.73
Organism:Homo sapiens (Human)
Description:P23458
Residue:1154
BDBM100349
NameBDBM100349
Synonyms:US10533001, Example Table 9a.2 US8501944, 371 | US9868729, Example 207
TypeSmall organic molecule
Emp. Form.C21H27N7O2
Mol. Mass.409.4848
SMILESCNC(=O)[C@H]1CCCN(C1)c1ccc(Nc2ncc(C(N)=O)c(NC3CC3)n2)cc1