Reaction Details
TargetE3 ubiquitin-protein ligase Mdm2
LigandBDBM143465
Substrate/Competitorn/a
Meas. Tech.Time Resolved Fluorescence Energy Transfer (TR-FRET) Assay
IC50 0.195±n/a nM
Citation Furet, PGuagnano, VHolzer, PMah, RMasuya, KSchlapbach, AStutz, SVaupel, A Pyrazolopyrrolidine compounds US Patent US8969341 Publication Date 3/3/2015
 
E3 ubiquitin-protein ligase Mdm2
Name:E3 ubiquitin-protein ligase Mdm2
Type:Oncoprotein
Mol. Mass.:55196.54
Organism:Homo sapiens (Human)
Description:Q00987
Residue:491
BDBM143465
NameBDBM143465
Synonyms:US8969341, 106
TypeSmall organic molecule
Emp. Form.C32H32Cl2N4O3
Mol. Mass.591.527
SMILESCOc1ccc(cc1-n1nc2C(=O)N(C(c2c1C(C)C)c1ccc(Cl)cc1C)c1cc(Cl)ccc1C)C(=O)N(C)C