Reaction Details
TargetE3 ubiquitin-protein ligase Mdm2
LigandBDBM143472
Substrate/Competitorn/a
Meas. Tech.Time Resolved Fluorescence Energy Transfer (TR-FRET) Assay
IC50 0.267±n/a nM
Citation Furet, PGuagnano, VHolzer, PMah, RMasuya, KSchlapbach, AStutz, SVaupel, A Pyrazolopyrrolidine compounds US Patent US8969341 Publication Date 3/3/2015
 
E3 ubiquitin-protein ligase Mdm2
Name:E3 ubiquitin-protein ligase Mdm2
Type:Oncoprotein
Mol. Mass.:55196.54
Organism:Homo sapiens (Human)
Description:Q00987
Residue:491
BDBM143472
NameBDBM143472
Synonyms:US8969341, 112
TypeSmall organic molecule
Emp. Form.C30H30Cl2N4O4
Mol. Mass.581.49
SMILESCOCCn1cc(cc(Cl)c1=O)N1C(c2c(nn(c2C(C)C)-c2ccccc2OC)C1=O)c1ccc(Cl)cc1C