Reaction Details
TargetE3 ubiquitin-protein ligase Mdm2
LigandBDBM143518
Substrate/Competitorn/a
Meas. Tech.Time Resolved Fluorescence Energy Transfer (TR-FRET) Assay
IC50 0.396±n/a nM
Citation Furet, PGuagnano, VHolzer, PMah, RMasuya, KSchlapbach, AStutz, SVaupel, A Pyrazolopyrrolidine compounds US Patent US8969341 Publication Date 3/3/2015
 
E3 ubiquitin-protein ligase Mdm2
Name:E3 ubiquitin-protein ligase Mdm2
Type:Oncoprotein
Mol. Mass.:55196.54
Organism:Homo sapiens (Human)
Description:Q00987
Residue:491
BDBM143518
NameBDBM143518
Synonyms:US8969341, 131
TypeSmall organic molecule
Emp. Form.C31H31Cl2N5O4
Mol. Mass.608.515
SMILESCOc1ccc(CNC(C)=O)cc1-n1nc2C(=O)N(C(c2c1C(C)C)c1ccc(Cl)cc1C)c1cc(Cl)c(=O)n(C)c1