Reaction Details
TargetE3 ubiquitin-protein ligase Mdm2
LigandBDBM143533
Substrate/Competitorn/a
Meas. Tech.Time Resolved Fluorescence Energy Transfer (TR-FRET) Assay
IC50 0.242±n/a nM
Citation Furet, PGuagnano, VHolzer, PMah, RMasuya, KSchlapbach, AStutz, SVaupel, A Pyrazolopyrrolidine compounds US Patent US8969341 Publication Date 3/3/2015
 
E3 ubiquitin-protein ligase Mdm2
Name:E3 ubiquitin-protein ligase Mdm2
Type:Oncoprotein
Mol. Mass.:55196.54
Organism:Homo sapiens (Human)
Description:Q00987
Residue:491
BDBM143533
NameBDBM143533
Synonyms:US8969341, 136
TypeSmall organic molecule
Emp. Form.C30H24ClN5O2
Mol. Mass.521.997
SMILESCOc1ccc(cc1-n1nc2C(=O)N(C(c2c1C(C)C)c1ccc(cc1)[N+]#[C-])c1cc(Cl)ccc1C)C#N