Reaction Details
TargetE3 ubiquitin-protein ligase Mdm2
LigandBDBM143571
Substrate/Competitorn/a
Meas. Tech.Time Resolved Fluorescence Energy Transfer (TR-FRET) Assay
IC50 0.12±n/a nM
Citation Furet, PGuagnano, VHolzer, PMah, RMasuya, KSchlapbach, AStutz, SVaupel, A Pyrazolopyrrolidine compounds US Patent US8969341 Publication Date 3/3/2015
 
E3 ubiquitin-protein ligase Mdm2
Name:E3 ubiquitin-protein ligase Mdm2
Type:Oncoprotein
Mol. Mass.:55196.54
Organism:Homo sapiens (Human)
Description:Q00987
Residue:491
BDBM143571
NameBDBM143571
Synonyms:US8969341, 148
TypeSmall organic molecule
Emp. Form.C27H27Cl2N7O3
Mol. Mass.568.454
SMILESCOc1nc(ncc1-n1nc2C(=O)N(C(c2c1C(C)C)c1ccc(Cl)cc1)c1cc(Cl)cn(C)c1=O)N(C)C