Reaction Details
TargetE3 ubiquitin-protein ligase Mdm2
LigandBDBM143577
Substrate/Competitorn/a
Meas. Tech.Time Resolved Fluorescence Energy Transfer (TR-FRET) Assay
IC50 0.25±n/a nM
Citation Furet, PGuagnano, VHolzer, PMah, RMasuya, KSchlapbach, AStutz, SVaupel, A Pyrazolopyrrolidine compounds US Patent US8969341 Publication Date 3/3/2015
 
E3 ubiquitin-protein ligase Mdm2
Name:E3 ubiquitin-protein ligase Mdm2
Type:Oncoprotein
Mol. Mass.:55196.54
Organism:Homo sapiens (Human)
Description:Q00987
Residue:491
BDBM143577
NameBDBM143577
Synonyms:US8969341, 150
TypeSmall organic molecule
Emp. Form.C28H27ClN8O3
Mol. Mass.559.019
SMILESCOc1nc(ncc1-n1nc2C(=O)N(C(c2c1C(C)C)c1ccc(cc1)C#N)c1cc(Cl)c(=O)n(C)c1)N(C)C