Reaction Details
TargetE3 ubiquitin-protein ligase Mdm2
LigandBDBM143592
Substrate/Competitorn/a
Meas. Tech.Time Resolved Fluorescence Energy Transfer (TR-FRET) Assay
IC50 0.176±n/a nM
Citation Furet, PGuagnano, VHolzer, PMah, RMasuya, KSchlapbach, AStutz, SVaupel, A Pyrazolopyrrolidine compounds US Patent US8969341 Publication Date 3/3/2015
 
E3 ubiquitin-protein ligase Mdm2
Name:E3 ubiquitin-protein ligase Mdm2
Type:Oncoprotein
Mol. Mass.:55196.54
Organism:Homo sapiens (Human)
Description:Q00987
Residue:491
BDBM143592
NameBDBM143592
Synonyms:US8969341, 155
TypeSmall organic molecule
Emp. Form.C25H22Cl2N6O4
Mol. Mass.541.386
SMILESCOc1ncc(c(OC)n1)-n1nc2C(=O)N(C(c2c1C(C)C)c1ccc(Cl)cc1)c1c[nH]c(=O)c(Cl)c1