Reaction Details
TargetTranslocator protein
LigandBDBM150168
Substrate/Competitorn/a
Meas. Tech.Competitive Binding Assay
Temperature303.15±n/a K
Ki 6.66±n/a nM
IC50 15.64±n/a nM
Commentsextracted
Citation Yang, RLi, YLi, YZhao, NYun, LQin, JFeng, ZZhang, Y 2-aryl imidazo[1,2-a]pyridine-3-acetamide derivatives, preparation methods and uses thereof US Patent US8980887 Publication Date 3/17/2015
 
Translocator protein
Name:Translocator protein
Type:Mitochondrion membrane protein
Mol. Mass.:18945.84
Organism:Rattus norvegicus (rat)
Description:Competitive binding experiments were performed on rat kidney mitochondrial membranes.
Residue:169
BDBM150168
NameBDBM150168
Synonyms:US8980887, Compound 11
TypeSmall organic molecule
Emp. Form.C25H24Cl2N4O2
Mol. Mass.483.39
SMILESCOCCN(Cc1ccccn1)C(=O)Cc1c(nc2cc(C)ccn12)-c1ccc(Cl)c(Cl)c1