Reaction Details
TargetNeuraminidase
LigandBDBM4996
Substrate/CompetitorBDBM4702
Meas. Tech.Neuraminidase Inhibition Assay
IC50 3±n/a nM
Citation Kim, CULew, WWilliams, MAWu, HZhang, LChen, XEscarpe, PAMendel, DBLaver, WGStevens, RC Structure-activity relationship studies of novel carbocyclic influenza neuraminidase inhibitors. J Med Chem41:2451-60 (1998) 
 
Neuraminidase
Name:Neuraminidase
Type:Enzyme
Mol. Mass.:50124.14
Organism:Influenza A virus (A/Puerto Rico/8/34/Mount Sinai(H1N1))
Description:P03468
Residue:454
BDBM4996
BDBM4702
NameBDBM4996
Synonyms:(3R,4R,5S)-4-Acetamido-5-amino-3-[[(1R)-1-ethylbut-3-enyl]oxy]-1-cyclohexene-1-carboxylic Acid Carbocyclic Analogue 46
TypeSmall organic molecule
Emp. Form.C15H24N2O4
Mol. Mass.296.3621
SMILESCC[C@H](CC=C)O[C@@H]1C=C(C[C@H](N)[C@H]1NC(C)=O)C(O)=O