Reaction Details
TargetNeuraminidase
LigandBDBM5015
Substrate/CompetitorBDBM4702
Meas. Tech.Neuraminidase Inhibition Assay
IC50 3±n/a nM
Citation Kim, CULew, WWilliams, MAWu, HZhang, LChen, XEscarpe, PAMendel, DBLaver, WGStevens, RC Structure-activity relationship studies of novel carbocyclic influenza neuraminidase inhibitors. J Med Chem41:2451-60 (1998) 
 
Neuraminidase
Name:Neuraminidase
Type:Enzyme
Mol. Mass.:50124.14
Organism:Influenza A virus (A/Puerto Rico/8/34/Mount Sinai(H1N1))
Description:P03468
Residue:454
BDBM5015
BDBM4702
NameBDBM5015
Synonyms:(3S,4R,5S)-5-amino-4-acetamido-2-fluoro-3-(pentan-3-yloxy)cyclohex-1-ene-1-carboxylic acid | Carbocyclic Analogue 30
TypeSmall organic molecule
Emp. Form.C14H23FN2O4
Mol. Mass.302.3418
SMILESCCC(CC)O[C@H]1[C@H](NC(C)=O)[C@@H](N)CC(C(O)=O)=C1F