Reaction Details
TargetAcetylcholinesterase
LigandBDBM152505
Substrate/Competitorn/a
Meas. Tech.Acetylcholinesterase Inhibition Assay
pH8±n/a
Ki 5.88±0.0 nM
IC50 5.25±0.0 nM
Commentsextracted
Citation Öztaskin, NÇetinkaya, YTaslimi, PGöksu, SGülçin, Ä° Antioxidant and acetylcholinesterase inhibition properties of novel bromophenol derivatives. Bioorg Chem60:49-57 (2015) 
 
Acetylcholinesterase
Name:Acetylcholinesterase
Type:Enzyme
Mol. Mass.:67792.70
Organism:Homo sapiens (Human)
Description:P22303
Residue:614
BDBM152505
NameBDBM152505
Synonyms:(2,4-dimethoxyphenyl)(4-methoxyphenyl)methanone (18)
TypeSmall organic molecule
Emp. Form.C16H16O4
Mol. Mass.272.2958
SMILESCOc1ccc(cc1)C(=O)c1ccc(OC)cc1OC