Reaction Details
TargetRibosyldihydronicotinamide dehydrogenase [quinone]
LigandBDBM50156670
Substrate/Competitorn/a
Meas. Tech.Fluorescence Titration Assay
Kd 36.4±1.7 nM
Citation Leung, KKShilton, BH Quinone reductase 2 is an adventitious target of protein kinase CK2 inhibitors TBBz (TBI) and DMAT. Biochemistry54:47-59 (2015) 
 
Ribosyldihydronicotinamide dehydrogenase [quinone]
Name:Ribosyldihydronicotinamide dehydrogenase [quinone]
Type:Protein
Mol. Mass.:25917.25
Organism:Homo sapiens (Human)
Description:P16083
Residue:231
BDBM50156670
NameBDBM50156670
Synonyms:2-(dimethylamino)-4,5,6,7-tetrabromo-1H-benzimidazole CHEMBL376505
TypeSmall organic molecule
Emp. Form.C9H7Br4N3
Mol. Mass.476.788
SMILESCN(C)c1nc2c(Br)c(Br)c(Br)c(Br)c2[nH]1