Reaction Details
TargetPeptidyl-prolyl cis-trans isomerase A
LigandBDBM286533
Substrate/Competitorn/a
Meas. Tech.Surface Plasmon Resonance (SPR) Assay
pH7.4±n/a
Kd 1.000±n/a nM
Commentsextracted
Citation Fu, JKarur, SLi, XLu, PMergo, WRivkin, ASweeney, ZKTjandra, MWeiss, AYifru, A Cyclic peptides and use as medicines US Patent US9566312 Publication Date 2/14/2017
 
Peptidyl-prolyl cis-trans isomerase A
Name:Peptidyl-prolyl cis-trans isomerase A
Type:Protein
Mol. Mass.:18015.32
Organism:Homo sapiens (Human)
Description:P62937
Residue:165
BDBM286533
NameBDBM286533
Synonyms:US9566312, Compound 2.5.14 | US9566312, Compound 2.5.15
TypeSmall organic molecule
Emp. Form.C70H125N13O12
Mol. Mass.1340.8214
SMILESCC[C@@H]1NC(=O)[C@H]([C@H](O)[C@H](C)C\C=C\C)N(C)C(=O)[C@H](C(C)C)N(C)C(=O)[C@H](CC(C)C)N(C)C(=O)[C@H](CC(C)C)N(C)C(=O)[C@@H](C)NC(=O)[C@H](C)NC(=O)[C@H](CC(C)C)N(C)C(=O)[C@@H](NC(=O)[C@H]([C@H](C)CN2CCN(CC2)C2CCC2)N(C)C(=O)[C@@H](C)N(C)C1=O)C(C)C