Reaction Details
TargetPeptidyl-prolyl cis-trans isomerase B
LigandBDBM286600
Substrate/Competitorn/a
Meas. Tech.Surface Plasmon Resonance (SPR) Assay
pH7.4±n/a
Kd 0.700±n/a nM
Commentsextracted
Citation Fu, JKarur, SLi, XLu, PMergo, WRivkin, ASweeney, ZKTjandra, MWeiss, AYifru, A Cyclic peptides and use as medicines US Patent US9566312 Publication Date 2/14/2017
 
Peptidyl-prolyl cis-trans isomerase B
Name:Peptidyl-prolyl cis-trans isomerase B
Type:Protein
Mol. Mass.:23751.82
Organism:Homo sapiens (Human)
Description:P23284
Residue:216
BDBM286600
NameBDBM286600
Synonyms:US9566312, Compound 2.18.4
TypeSmall organic molecule
Emp. Form.C68H122N12O13
Mol. Mass.1315.7689
SMILESCC[C@@H]1NC(=O)[C@H]([C@H](O)[C@H](C)C\C=C\C)N(C)C(=O)[C@H](C(C)C)N(C)C(=O)[C@H](CC(C)C)N(C)C(=O)[C@H](CC(C)C)N(C)C(=O)[C@@H](C)NC(=O)[C@H](C)NC(=O)[C@H](CC(C)C)N(C)C(=O)[C@@H](NC(=O)[C@H]([C@H](C)CCN2CCOC[C@@H]2C)N(C)C(=O)[C@@H](C)N(C)C1=O)C(C)C