Reaction Details
TargetProstaglandin G/H synthase 2
LigandBDBM50029593
Substrate/Competitorn/a
Meas. Tech.In vitro Cyclooxygenase Inhibition Assay
pH8±n/a
Temperature298.15±n/a K
IC50 2.1e+3±n/a nM
Commentsextracted
Citation Irannejad, HUnsal Tan, OOzadali, KDadashpour, STuylu Kucukkilinc, TAhangar, NAhmadnejad, MEmami, S 1,2-Diaryl-2-hydroxyiminoethanones as dual COX-1 and ß-amyloid aggregation inhibitors: biological evaluation and in silico study. Chem Biol Drug Des85:494-503 (2015) 
 
Prostaglandin G/H synthase 2
Name:Prostaglandin G/H synthase 2
Type:Enzyme
Mol. Mass.:69003.89
Organism:Homo sapiens (Human)
Description:Recombinant Cox-2 provided by Cayman (Cayman Chemical Co.,Ann Arbor, MI).
Residue:604
BDBM50029593
NameBDBM50029593
Synonyms:CHEMBL7162 N-(2-Cyclohexyloxy-4-nitro-phenyl)-methanesulfonamide N-[2-(cyclohexyloxy)-4-nitrophenyl]methane sulfonamide N-{2-(cyclohexyloxy)-4-[hydroxy(oxido)amino]phenyl}methanesulfonamide NS398
TypeSmall organic molecule
Emp. Form.C13H18N2O5S
Mol. Mass.314.357
SMILESCS(=O)(=O)Nc1ccc(cc1OC1CCCCC1)[N+]([O-])=O