Reaction Details
TargetTyrosine-protein kinase JAK1
LigandBDBM153672
Substrate/Competitorn/a
Meas. Tech.Inhibition Assay
pH7.2±n/a
Ki 1±n/a nM
Commentsextracted
Citation Gibbons, PHanan, ELiu, WLyssikatos, JPMagnuson, SRMendonca, RPastor, RRawson, TESiu, MZak, MZhou, AZhu, B Pyrazolopyrimidine JAK inhibitor compounds and methods US Patent US8999998 Publication Date 4/7/2015
 
Tyrosine-protein kinase JAK1
Name:Tyrosine-protein kinase JAK1
Type:Protein
Mol. Mass.:133293.73
Organism:Homo sapiens (Human)
Description:P23458
Residue:1154
BDBM153672
NameBDBM153672
Synonyms:US8999998, 359
TypeSmall organic molecule
Emp. Form.C24H23N7O3
Mol. Mass.457.4845
SMILESCOc1ccc(cc1-c1nn(CC2(O)CCCC2)cc1NC(=O)c1cnn2cccnc12)C#N