Reaction Details
TargetTyrosine-protein kinase JAK1
LigandBDBM153678
Substrate/Competitorn/a
Meas. Tech.Inhibition Assay
pH7.2±n/a
Ki 1.6±n/a nM
Commentsextracted
Citation Gibbons, PHanan, ELiu, WLyssikatos, JPMagnuson, SRMendonca, RPastor, RRawson, TESiu, MZak, MZhou, AZhu, B Pyrazolopyrimidine JAK inhibitor compounds and methods US Patent US8999998 Publication Date 4/7/2015
 
Tyrosine-protein kinase JAK1
Name:Tyrosine-protein kinase JAK1
Type:Protein
Mol. Mass.:133293.73
Organism:Homo sapiens (Human)
Description:P23458
Residue:1154
BDBM153678
NameBDBM153678
Synonyms:US8999998, 499
TypeSmall organic molecule
Emp. Form.C20H19ClN8O3
Mol. Mass.454.87
SMILESCOc1ncc(Cl)cc1-c1nn(CC(=O)N(C)C)cc1NC(=O)c1cnn2cccnc12