Reaction Details
TargetTyrosine-protein kinase JAK2
LigandBDBM153670
Substrate/Competitorn/a
Meas. Tech.Inhibition Assay
pH7.2±n/a
Ki 3.1±n/a nM
Commentsextracted
Citation Gibbons, PHanan, ELiu, WLyssikatos, JPMagnuson, SRMendonca, RPastor, RRawson, TESiu, MZak, MZhou, AZhu, B Pyrazolopyrimidine JAK inhibitor compounds and methods US Patent US8999998 Publication Date 4/7/2015
 
Tyrosine-protein kinase JAK2
Name:Tyrosine-protein kinase JAK2
Type:Protein
Mol. Mass.:130684.68
Organism:Homo sapiens (Human)
Description:O60674
Residue:1132
BDBM153670
NameBDBM153670
Synonyms:US8999998, 283
TypeSmall organic molecule
Emp. Form.C24H24ClN7O3
Mol. Mass.493.945
SMILESCOc1ccc(Cl)cc1-c1nn(CC(=O)N2CCCC2C)cc1NC(=O)c1cnn2cccnc12