Reaction Details
TargetNon-receptor tyrosine-protein kinase TYK2
LigandBDBM153669
Substrate/Competitorn/a
Meas. Tech.Inhibition Assay
pH7.2±n/a
Ki 2.3±n/a nM
Commentsextracted
Citation Gibbons, PHanan, ELiu, WLyssikatos, JPMagnuson, SRMendonca, RPastor, RRawson, TESiu, MZak, MZhou, AZhu, B Pyrazolopyrimidine JAK inhibitor compounds and methods US Patent US8999998 Publication Date 4/7/2015
 
Non-receptor tyrosine-protein kinase TYK2
Name:Non-receptor tyrosine-protein kinase TYK2
Type:Protein
Mol. Mass.:133666.03
Organism:Homo sapiens (Human)
Description:P29597
Residue:1187
BDBM153669
NameBDBM153669
Synonyms:US8999998, 217
TypeSmall organic molecule
Emp. Form.C19H17ClN8O3
Mol. Mass.440.843
SMILESCOc1ccc(Cl)cc1-c1c(NC(=O)c2c(N)nn3cccnc23)cnn1CC(N)=O