Reaction Details
TargetPhospholipase D2
LigandBDBM20608
Substrate/Competitorn/a
Meas. Tech.In vivo Deuterated 1-Butanol PLD Assay
IC50 20000±300 nM
Citation Scott, SASpencer, CTO'Reilly, MCBrown, KALavieri, RRCho, CHJung, DILarock, RCBrown, HALindsley, CW Discovery of desketoraloxifene analogues as inhibitors of mammalian, Pseudomonas aeruginosa, and NAPE phospholipase D enzymes. ACS Chem Biol10:421-32 (2015) 
 
Phospholipase D2
Name:Phospholipase D2
Type:Protein
Mol. Mass.:106002.47
Organism:Homo sapiens (Human)
Description:n/a
Residue:933
BDBM20608
NameBDBM20608
Synonyms:4-Hydroxytamoxifen 4-[(1Z)-1-{4-[2-(dimethylamino)ethoxy]phenyl}-2-phenylbut-1-en-1-yl]phenol CHEMBL489 cid_449459
TypeSmall organic molecule
Emp. Form.C26H29NO2
Mol. Mass.387.514
SMILESCC\C(=C(/c1ccc(O)cc1)c1ccc(OCCN(C)C)cc1)c1ccccc1